Reaction Details
TargetAdenosine receptor A1
LigandBDBM50453531
Substrate/Competitorn/a
Meas. Tech.ChEMBL_29150 (CHEMBL639430)
Ki 3.2±n/a nM
Citation Gallo-Rodriguez, CJi, XDMelman, NSiegman, BDSanders, LHOrlina, JFischer, BPu, QOlah, MEvan Galen, PJ Structure-activity relationships of N6-benzyladenosine-5'-uronamides as A3-selective adenosine agonists. J Med Chem37:636-46 (1994) Adenosine receptor A1
Name:Adenosine receptor A1
Type:Protein
Mol. Mass.:36704.13
Organism:Rattus norvegicus (rat)
Description:n/a
Residue:326
BDBM50453531
NameBDBM50453531
Synonyms:CHEMBL2113639
TypeSmall organic molecule
Emp. Form.C20H24N6O4
Mol. Mass.412.4424
SMILESCCNC(=O)[C@H]1O[C@H]([C@H](O)[C@@H]1O)n1cnc2c(N[C@H](C)c3ccccc3)ncnc12