Reaction Details
TargetAdenosine receptor A3
LigandBDBM50453541
Substrate/Competitorn/a
Meas. Tech.ChEMBL_30471 (CHEMBL643132)
Ki 4.3±n/a nM
Citation Gallo-Rodriguez, CJi, XDMelman, NSiegman, BDSanders, LHOrlina, JFischer, BPu, QOlah, MEvan Galen, PJ Structure-activity relationships of N6-benzyladenosine-5'-uronamides as A3-selective adenosine agonists. J Med Chem37:636-46 (1994) Adenosine receptor A3
Name:Adenosine receptor A3
Type:PROTEIN
Mol. Mass.:36643.73
Organism:Rattus norvegicus
Description:ChEMBL_479910
Residue:320
BDBM50453541
NameBDBM50453541
Synonyms:CHEMBL2113611
TypeSmall organic molecule
Emp. Form.C20H24N6O5
Mol. Mass.428.4418
SMILESCCNC(=O)[C@H]1O[C@H]([C@H](O)[C@@H]1O)n1cnc2c(NCc3cccc(OC)c3)ncnc12