Reaction Details
TargetAdenosine receptor A1
LigandBDBM50389797
Substrate/Competitorn/a
Meas. Tech.ChEMBL_29150 (CHEMBL639430)
Ki 6.4±n/a nM
Citation Gallo-Rodriguez, CJi, XDMelman, NSiegman, BDSanders, LHOrlina, JFischer, BPu, QOlah, MEvan Galen, PJ Structure-activity relationships of N6-benzyladenosine-5'-uronamides as A3-selective adenosine agonists. J Med Chem37:636-46 (1994) Adenosine receptor A1
Name:Adenosine receptor A1
Type:Protein
Mol. Mass.:36704.13
Organism:Rattus norvegicus (rat)
Description:n/a
Residue:326
BDBM50389797
NameBDBM50389797
Synonyms:CHEMBL261482
TypeSmall organic molecule
Emp. Form.C13H16N6O4
Mol. Mass.320.3039
SMILESNc1ncnc2n(cnc12)[C@@H]1O[C@@H]([C@@H](O)[C@H]1O)C(=O)NC1CC1