Reaction Details
TargetKynureninase
LigandBDBM50040568
Substrate/Competitorn/a
Meas. Tech.ChEMBL_91724 (CHEMBL702022)
IC50 900000±n/a nM
Citation Pellicciari, RNatalini, BCostantino, GMahmoud, MRMattoli, LSadeghpour, BMMoroni, FChiarugi, ACarpenedo, R Modulation of the kynurenine pathway in search for new neuroprotective agents. Synthesis and preliminary evaluation of (m-nitrobenzoyl)alanine, a potent inhibitor of kynurenine-3-hydroxylase. J Med Chem37:647-55 (1994) Kynureninase
Name:Kynureninase
Type:PROTEIN
Mol. Mass.:52470.50
Organism:Rattus norvegicus
Description:ChEMBL_91725
Residue:464
BDBM50040568
NameBDBM50040568
Synonyms:CHEMBL157866 | para-nitrobenzoyl)alanine
TypeSmall organic molecule
Emp. Form.C10H10N2O5
Mol. Mass.238.1968
SMILES[NH3+]C(CC(=O)c1ccc(cc1)[N+]([O-])=O)C([O-])=O