Reaction Details
TargetGastrin/cholecystokinin type B receptor
LigandBDBM50040671
Substrate/Competitorn/a
Meas. Tech.ChEMBL_47969 (CHEMBL657472)
IC50 0.53±n/a nM
Citation Showell, GABourrain, SNeduvelil, JGFletcher, SRBaker, RWatt, APFletcher, AEFreedman, SBKemp, JAMarshall, GR High-affinity and potent, water-soluble 5-amino-1,4-benzodiazepine CCKB/gastrin receptor antagonists containing a cationic solubilizing group. J Med Chem37:719-21 (1994) Gastrin/cholecystokinin type B receptor
Name:Gastrin/cholecystokinin type B receptor
Type:G Protein-Coupled Receptor (GPCR)
Mol. Mass.:48445.79
Organism:Homo sapiens (Human)
Description:Stable expression of human CCK-2 receptors in HEK 293 cells.
Residue:447
BDBM50040671
NameBDBM50040671
Synonyms:1-[5-(3-Aza-bicyclo[3.2.2]non-3-yl)-1-methyl-2-oxo-2,3-dihydro-1H-benzo[e][1,4]diazepin-3-yl]-3-m-tolyl-urea L-740,093
TypeSmall organic molecule
Emp. Form.C26H31N5O2
Mol. Mass.445.5566
SMILESCN1c2ccccc2C(=NC(NC(=O)Nc2cccc(C)c2)C1=O)N1CC2CCC(CC2)C1