Reaction Details
TargetSodium-dependent serotonin transporter
LigandBDBM50041293
Substrate/Competitorn/a
Meas. Tech.ChEMBL_201980 (CHEMBL809425)
Ki 0.394±n/a nM
Citation Davies, HMSaikali, EHuby, NJGilliatt, VJMatasi, JJSexton, TChilders, SR Synthesis of 2 beta-acyl-3 beta-aryl-8-azabicyclo[3.2.1]octanes and their binding affinities at dopamine and serotonin transport sites in rat striatum and frontal cortex. J Med Chem37:1262-8 (1994) Sodium-dependent serotonin transporter
Name:Sodium-dependent serotonin transporter
Type:Multi-pass membrane protein
Mol. Mass.:70168.43
Organism:Rattus norvegicus (rat)
Description:P31652
Residue:630
BDBM50041293
NameBDBM50041293
Synonyms:1-(8-Methyl-3-naphthalen-2-yl-8-aza-bicyclo[3.2.1]oct-2-yl)-propan-1-one WF-23
TypeSmall organic molecule
Emp. Form.C21H25NO
Mol. Mass.307.4293
SMILESCCC(=O)C1C2CCC(CC1c1ccc3ccccc3c1)N2C