Reaction Details
TargetAminopeptidase N
LigandBDBM50036828
Substrate/Competitorn/a
Meas. Tech.ChEMBL_35505 (CHEMBL646415)
IC50 30±n/a nM
Citation Chauvel, ENCoric, PLlorens-Cortès, CWilk, SRoques, BPFournié-Zaluski, MC Investigation of the active site of aminopeptidase A using a series of new thiol-containing inhibitors. J Med Chem37:1339-46 (1994) Aminopeptidase N
Name:Aminopeptidase N
Type:PROTEIN
Mol. Mass.:109522.63
Organism:Homo sapiens (Human)
Description:ChEMBL_1507526
Residue:967
BDBM50036828
NameBDBM50036828
Synonyms:1-Mercaptomethyl-2-phenyl-ethyl-ammonium CHEMBL414393
TypeSmall organic molecule
Emp. Form.C9H13NS
Mol. Mass.167.271
SMILESNC(CS)Cc1ccccc1