Reaction Details
TargetVoltage-dependent L-type calcium channel subunit alpha-1C
LigandBDBM50035794
Substrate/Competitorn/a
Meas. Tech.ChEMBL_53172 (CHEMBL666481)
Kd 5±n/a nM
Citation Rovnyak, GCKimball, SDBeyer, BCucinotta, GDiMarco, JDGougoutas, JHedberg, AMalley, MMcCarthy, JPZhang, R Calcium entry blockers and activators: conformational and structural determinants of dihydropyrimidine calcium channel modulators. J Med Chem38:119-29 (1995) Voltage-dependent L-type calcium channel subunit alpha-1C
Name:Voltage-dependent L-type calcium channel subunit alpha-1C
Type:Enzyme Catalytic Domain
Mol. Mass.:248979.79
Organism:Homo sapiens (Human)
Description:Calcium channel (Type L) 0 HUMAN::Q13936
Residue:2221
BDBM50035794
NameBDBM50035794
Synonyms:4-Methyl-2-methylsulfanyl-13-nitro-3,8,9,10,11,16b-hexahydro-7H-6-oxa-12-thia-1,3-diaza-dibenzo[a,c]cyclododecen-5-one | CHEMBL23692
TypeSmall organic molecule
Emp. Form.C18H21N3O4S2
Mol. Mass.407.507
SMILESCSC1=NC(C)=C2C([N-]1)c1cccc(c1SCCCCCOC2=[OH+])[N+]([O-])=O