Reaction Details
TargetAlpha-1A adrenergic receptor
LigandBDBM50034681
Substrate/Competitorn/a
Meas. Tech.ChEMBL_33603 (CHEMBL652811)
Ki 0.32±n/a nM
Citation Wetzel, JMMiao, SWForray, CBorden, LABranchek, TAGluchowski, C Discovery of alpha 1a-adrenergic receptor antagonists based on the L-type Ca2+ channel antagonist niguldipine. J Med Chem38:1579-81 (1995) Alpha-1A adrenergic receptor
Name:Alpha-1A adrenergic receptor
Type:Cell-surface receptors
Mol. Mass.:51511.67
Organism:Homo sapiens (Human)
Description:P35348
Residue:466
BDBM50034681
NameBDBM50034681
Synonyms:2,6-Dimethyl-4-(4-nitro-phenyl)-1,4-dihydro-pyridine-3,5-dicarboxylic acid 3-[3-(4,4-diphenyl-piperidin-1-yl)-propyl] ester 5-methyl ester | CHEMBL290860
TypeSmall organic molecule
Emp. Form.C36H39N3O6
Mol. Mass.609.7114
SMILESCOC(=[OH+])C1=C(C)N=C(C)C(C1c1ccc(cc1)[N+]([O-])=O)=C([O-])OCCCN1CCC(CC1)(c1ccccc1)c1ccccc1