Reaction Details
TargetThermolysin
LigandBDBM50035247
Substrate/Competitorn/a
Meas. Tech.ChEMBL_210393 (CHEMBL814123)
IC50 5±n/a nM
Citation Bihovsky, RLevinson, BLLoewi, RCErhardt, PWPolokoff, MA Hydroxamic acids as potent inhibitors of endothelin-converting enzyme from human bronchiolar smooth muscle. J Med Chem38:2119-29 (1995) Thermolysin
Name:Thermolysin
Type:PROTEIN
Mol. Mass.:60097.54
Organism:Bacillus thermoproteolyticus
Description:ChEMBL_1468794
Residue:548
BDBM50035247
NameBDBM50035247
Synonyms:2-(2-Hydroxycarbamoyl-3-methyl-butyrylamino)-3-(1H-indol-3-yl)-propionic acid | CHEMBL66967
TypeSmall organic molecule
Emp. Form.C17H21N3O5
Mol. Mass.347.3657
SMILESCC(C)C(C(=O)NO)C(=O)NC(Cc1c[nH]c2ccccc12)C(O)=O