Reaction Details
TargetThermolysin
LigandBDBM50035239
Substrate/Competitorn/a
Meas. Tech.ChEMBL_210393 (CHEMBL814123)
IC50 9±n/a nM
Citation Bihovsky, RLevinson, BLLoewi, RCErhardt, PWPolokoff, MA Hydroxamic acids as potent inhibitors of endothelin-converting enzyme from human bronchiolar smooth muscle. J Med Chem38:2119-29 (1995) Thermolysin
Name:Thermolysin
Type:PROTEIN
Mol. Mass.:60097.54
Organism:Bacillus thermoproteolyticus
Description:ChEMBL_1468794
Residue:548
BDBM50035239
NameBDBM50035239
Synonyms:CHEMBL63317 | N-[1-Carbamoyl-2-(1H-indol-3-yl)-ethyl]-N'-hydroxy-2-isopropyl-malonamide
TypeSmall organic molecule
Emp. Form.C17H22N4O4
Mol. Mass.346.381
SMILESCC(C)C(C(=O)NO)C(=O)NC(Cc1c[nH]c2ccccc12)C(N)=O