Reaction Details
Target5-hydroxytryptamine receptor 1A
LigandBDBM50035366
Substrate/Competitorn/a
Meas. Tech.ChEMBL_1468 (CHEMBL616591)
Ki 0.24±n/a nM
Citation Ennis, MDStjernlöf, PHoffman, RLGhazal, NBSmith, MWSvensson, KWikström, HHaadsma-Svensson, SRLin, CH Structure-activity relationships in the 8-amino-6,7,8,9-tetrahydro-3H-benz[e]indole ring system. 2. Effects of 8-amino nitrogen substitution on serotonin receptor binding and pharmacology. J Med Chem38:2217-30 (1995) 5-hydroxytryptamine receptor 1A
Name:5-hydroxytryptamine receptor 1A
Type:G Protein-Coupled Receptor (GPCR)
Mol. Mass.:46445.29
Organism:Rattus norvegicus (rat)
Description:Binding assays were performed using rat hippocampal membranes.
Residue:422
BDBM50035366
NameBDBM50035366
Synonyms:8-Azepan-1-yl-6,7,8,9-tetrahydro-3H-benzo[e]indole-1-carbaldehyde | CHEMBL306198
TypeSmall organic molecule
Emp. Form.C19H24N2O
Mol. Mass.296.4067
SMILESO=Cc1c[nH]c2ccc3CCC(Cc3c12)N1CCCCCC1