Reaction Details
TargetPotassium voltage-gated channel subfamily H member 2
LigandBDBM50369029
Substrate/Competitorn/a
Meas. Tech.ChEMBL_75160 (CHEMBL684971)
IC50 85000±n/a nM
Citation Johnson, RESilver, PJBecker, RBirsner, NCBohnet, EABriggs, GMBusacca, CACanniff, PCarabateas, PMChadwick, CC 4,5-Dihydro-3-(methanesulfonamidophenyl)-1-phenyl-1H-2,4-benzodiazepines: a novel class III antiarrhythmic agents. J Med Chem38:2551-6 (1995) Potassium voltage-gated channel subfamily H member 2
Name:Potassium voltage-gated channel subfamily H member 2
Type:Multi-pass membrane protein
Mol. Mass.:126672.65
Organism:Homo sapiens (Human)
Description:Q12809
Residue:1159
BDBM50369029
NameBDBM50369029
Synonyms:CHEMBL1788304
TypeSmall organic molecule
Emp. Form.C25H25F2N3O2S
Mol. Mass.469.547
SMILESCN1Cc2ccccc2[C@@H](N=C1CCc1ccc(NS(C)(=O)=O)cc1)c1ccc(F)cc1F