Reaction Details
TargetPotassium voltage-gated channel subfamily H member 2
LigandBDBM50031720
Substrate/Competitorn/a
Meas. Tech.ChEMBL_75160 (CHEMBL684971)
IC50 44000±n/a nM
Citation Johnson, RESilver, PJBecker, RBirsner, NCBohnet, EABriggs, GMBusacca, CACanniff, PCarabateas, PMChadwick, CC 4,5-Dihydro-3-(methanesulfonamidophenyl)-1-phenyl-1H-2,4-benzodiazepines: a novel class III antiarrhythmic agents. J Med Chem38:2551-6 (1995) Potassium voltage-gated channel subfamily H member 2
Name:Potassium voltage-gated channel subfamily H member 2
Type:Multi-pass membrane protein
Mol. Mass.:126672.65
Organism:Homo sapiens (Human)
Description:Q12809
Residue:1159
BDBM50031720
NameBDBM50031720
Synonyms:(Dofetilide) N-[4-(2-{[2-(4-Methanesulfonylamino-phenyl)-ethyl]-methylamino}-ethoxy)-phenyl]-methanesulfonamide DOFETILIDE N-[4-(2-{[2-(4-Methanesulfonylamino-phenyl)-ethyl]-methyl-amino}-ethoxy)-phenyl]-methanesulfonamide (UK-68798) N-[4-(2-{[2-(4-methanesulfonylamino-phenoxy)-ethyl]-methyl-amino}-ethyl)-phenyl]-methanesulfonamide UK-68,798 | US10167299, Dofetilide
TypeSmall organic molecule
Emp. Form.C19H27N3O5S2
Mol. Mass.441.565
SMILESCN(CCOc1ccc(NS(C)(=O)=O)cc1)CCc1ccc(NS(C)(=O)=O)cc1