Reaction Details
Target3-oxo-5-alpha-steroid 4-dehydrogenase 1
LigandBDBM50043604
Substrate/Competitorn/a
Meas. Tech.ChEMBL_204755 (CHEMBL804516)
IC50 1600±n/a nM
Citation Frye, SVHaffner, CDMaloney, PRHiner, RNDorsey, GFNoe, RAUnwalla, RJBatchelor, KWBramson, HNStuart, JD Structure-activity relationships for inhibition of type 1 and 2 human 5 alpha-reductase and human adrenal 3 beta-hydroxy-delta 5-steroid dehydrogenase/3-keto-delta 5-steroid isomerase by 6-azaandrost-4-en-3-ones: optimization of the C17 substituent. J Med Chem38:2621-7 (1995) 3-oxo-5-alpha-steroid 4-dehydrogenase 1
Name:3-oxo-5-alpha-steroid 4-dehydrogenase 1
Type:Enzyme
Mol. Mass.:29472.80
Organism:Homo sapiens (Human)
Description:P18405
Residue:259
BDBM50043604
NameBDBM50043604
Synonyms:(8S,9S,10R,13S,14S,17S)-17-(tert-butylcarbamoyl)-10,13-dimethyl-2,7,8,9,10,11,12,13,14,15,16,17-dodecahydro-1H-cyclopenta[a]phenanthrene-3-carboxylic acid CHEMBL138225 | Epristeride
TypeSmall organic molecule
Emp. Form.C25H37NO3
Mol. Mass.399.5662
SMILESCC(C)(C)NC(=O)[C@H]1CC[C@H]2[C@@H]3CC=C4C=C(CC[C@]4(C)[C@H]3CC[C@]12C)C(O)=O