Reaction Details
TargetB2 bradykinin receptor
LigandBDBM50403371
Substrate/Competitorn/a
Meas. Tech.ChEMBL_40271 (CHEMBL656506)
IC50 5.4±n/a nM
Citation Stahl, WBreipohl, GKuhlmann, LSteinsträsser, AGerhards, HJSchölkens, BA Technetium-99m-labeled HOE 140: a potential bradykinin B2 receptor imaging agent. J Med Chem38:2799-801 (1995) B2 bradykinin receptor
Name:B2 bradykinin receptor
Type:n/a
Mol. Mass.:42217.03
Organism:Cavia porcellus
Description:n/a
Residue:372
BDBM50403371
NameBDBM50403371
Synonyms:Firazyr ICATIBANT
TypeSmall organic molecule
Emp. Form.C59H89N19O13S
Mol. Mass.1304.522
SMILES[#7]-[#6@H](-[#6]-[#6]-[#6]\[#7]=[#6](\[#7])-[#7])-[#6](=O)-[#7]-[#6@@H](-[#6]-[#6]-[#6]\[#7]=[#6](\[#7])-[#7])-[#6](=O)-[#7]-1-[#6]-[#6]-[#6]-[#6@H]-1-[#6](=O)-[#7]-1-[#6]-[#6@H](-[#8])-[#6]-[#6@H]-1-[#6](=O)-[#7]-[#6]-[#6](=O)-[#7]-[#6@@H](-[#6]-c1cccs1)-[#6](=O)-[#7]-[#6@@H](-[#6]-[#8])-[#6](=O)-[#7]-1-[#6]-c2ccccc2-[#6]-[#6@@H]-1-[#6](=O)-[#7]-1-[#6@H]-2-[#6]-[#6]-[#6]-[#6]-[#6@H]-2-[#6]-[#6@H]-1-[#6](=O)-[#7]-[#6@@H](-[#6]-[#6]-[#6]\[#7]=[#6](\[#7])-[#7])-[#6](-[#8])=O