Reaction Details
TargetSigma non-opioid intracellular receptor 1
LigandBDBM50032410
Substrate/Competitorn/a
Meas. Tech.ChEMBL_201916 (CHEMBL808205)
Ki 0.670000±n/a nM
Citation Danso-Danquah, RBai, XZhang, XMascarella, SWWilliams, WSine, BBowen, WDCarroll, FI Synthesis and sigma binding properties of 2'-substituted 5,9 alpha-dimethyl-6,7-benzomorphans. J Med Chem38:2978-85 (1995) Sigma non-opioid intracellular receptor 1
Name:Sigma non-opioid intracellular receptor 1
Type:Enzyme Catalytic Domain
Mol. Mass.:25124.85
Organism:Homo sapiens (Human)
Description:Q99720
Residue:223
BDBM50032410
NameBDBM50032410
Synonyms:3-Benzyl-6,11-dimethyl-1,2,3,4,5,6-hexahydro-2,6-methano-benzo[d]azocin-8-ol | CHEMBL318877
TypeSmall organic molecule
Emp. Form.C21H25NO
Mol. Mass.307.4293
SMILESCC1C2Cc3ccc(O)cc3C1(C)CCN2Cc1ccccc1