Reaction Details
TargetSigma non-opioid intracellular receptor 1
LigandBDBM50032404
Substrate/Competitorn/a
Meas. Tech.ChEMBL_201916 (CHEMBL808205)
Ki 1.6±n/a nM
Citation Danso-Danquah, RBai, XZhang, XMascarella, SWWilliams, WSine, BBowen, WDCarroll, FI Synthesis and sigma binding properties of 2'-substituted 5,9 alpha-dimethyl-6,7-benzomorphans. J Med Chem38:2978-85 (1995) Sigma non-opioid intracellular receptor 1
Name:Sigma non-opioid intracellular receptor 1
Type:Enzyme Catalytic Domain
Mol. Mass.:25124.85
Organism:Homo sapiens (Human)
Description:Q99720
Residue:223
BDBM50032404
NameBDBM50032404
Synonyms:6,11-Dimethyl-3-(3-methyl-but-2-enyl)-1,2,3,4,5,6-hexahydro-2,6-methano-benzo[d]azocine | CHEMBL330601
TypeSmall organic molecule
Emp. Form.C19H27N
Mol. Mass.269.4244
SMILES[#6]-[#6]1-[#6]-2-[#6]-c3ccccc3C1([#6])[#6]-[#6]-[#7]-2-[#6]\[#6]=[#6](\[#6])-[#6]