Reaction Details
TargetSodium-dependent dopamine transporter
LigandBDBM50004169
Substrate/Competitorn/a
Meas. Tech.ChEMBL_62477 (CHEMBL677369)
Ki 0.59±n/a nM
Citation Kozikowski, APEddine Saiah, MKJohnson, KMBergmann, JS Chemistry and biology of the 2 beta-alkyl-3 beta-phenyl analogues of cocaine: subnanomolar affinity ligands that suggest a new pharmacophore model at the C-2 position. J Med Chem38:3086-93 (1995) Sodium-dependent dopamine transporter
Name:Sodium-dependent dopamine transporter
Type:Multi-pass membrane protein
Mol. Mass.:68749.45
Organism:Rattus norvegicus (rat)
Description:P23977
Residue:619
BDBM50004169
NameBDBM50004169
Synonyms:(2S,3S)-3-(4-Chloro-phenyl)-8-methyl-2-vinyl-8-aza-bicyclo[3.2.1]octane CHEMBL281288
TypeSmall organic molecule
Emp. Form.C16H20ClN
Mol. Mass.261.79
SMILESCN1C2CCC1[C@@H](C=C)[C@H](C2)c1ccc(Cl)cc1