Reaction Details
TargetD(1A) dopamine receptor
LigandBDBM50033114
Substrate/Competitorn/a
Meas. Tech.ChEMBL_60491 (CHEMBL674247)
Ki 49±n/a nM
Citation Michaelides, MRHong, YDiDomenico, SAsin, KEBritton, DRLin, CWWilliams, MShiosaki, K (5aR,11bS)-4,5,5a,6,7,11b-hexahydro-2-propyl-3-thia-5-azacyclopent-1- ena[c]-phenanthrene-9,10-diol (A-86929): a potent and selective dopamine D1 agonist that maintains behavioral efficacy following repeated administration and characterization of its diacetyl prodrug (ABT-431). J Med Chem38:3445-7 (1995) D(1A) dopamine receptor
Name:D(1A) dopamine receptor
Type:Enzyme
Mol. Mass.:49303.43
Organism:Homo sapiens (Human)
Description:P21728
Residue:446
BDBM50033114
NameBDBM50033114
Synonyms:(5aR,11bS)-2-Propyl-4,5,5a,6,7,11b-hexahydro-3-thia-5-aza-cyclopenta[c]phenanthrene-9,10-diol A-86929 | CHEMBL28338
TypeSmall organic molecule
Emp. Form.C18H21NO2S
Mol. Mass.315.43
SMILESCCCc1cc2[C@H]3[C@@H](CCc4cc(O)c(O)cc34)NCc2s1