Reaction Details
TargetD(1A) dopamine receptor
LigandBDBM50033116
Substrate/Competitorn/a
Meas. Tech.ChEMBL_60491 (CHEMBL674247)
Ki 21±n/a nM
Citation Michaelides, MRHong, YDiDomenico, SAsin, KEBritton, DRLin, CWWilliams, MShiosaki, K (5aR,11bS)-4,5,5a,6,7,11b-hexahydro-2-propyl-3-thia-5-azacyclopent-1- ena[c]-phenanthrene-9,10-diol (A-86929): a potent and selective dopamine D1 agonist that maintains behavioral efficacy following repeated administration and characterization of its diacetyl prodrug (ABT-431). J Med Chem38:3445-7 (1995) D(1A) dopamine receptor
Name:D(1A) dopamine receptor
Type:Enzyme
Mol. Mass.:49303.43
Organism:Homo sapiens (Human)
Description:P21728
Residue:446
BDBM50033116
NameBDBM50033116
Synonyms:(1R,3S)-3-Adamantan-1-yl-1-aminomethyl-isochroman-5,6-diol CHEMBL291143 | cid_6603703
TypeSmall organic molecule
Emp. Form.C20H27NO3
Mol. Mass.329.4333
SMILESNC[C@@H]1O[C@@H](Cc2c(O)c(O)ccc12)C12CC3CC(CC(C3)C1)C2