Reaction Details
TargetMuscarinic acetylcholine receptor M1
LigandBDBM50033148
Substrate/Competitorn/a
Meas. Tech.ChEMBL_138811 (CHEMBL747492)
IC50 4.5±n/a nM
Citation Ward, JSMerritt, LCalligaro, DOBymaster, FPShannon, HESawyer, BDMitch, CHDeeter, JBPeters, SCSheardown, MJ Functionally selective M1 muscarinic agonists. 3. Side chains and azacycles contributing to functional muscarinic selectivity among pyrazinylazacycles. J Med Chem38:3469-81 (1995) Muscarinic acetylcholine receptor M1
Name:Muscarinic acetylcholine receptor M1
Type:Enzyme Catalytic Domain
Mol. Mass.:51390.46
Organism:RAT
Description:P08482
Residue:460
BDBM50033148
NameBDBM50033148
Synonyms:3-(3-Hexyloxy-pyrazin-2-yl)-1-aza-bicyclo[2.2.2]octane | CHEMBL117666
TypeSmall organic molecule
Emp. Form.C17H27N3O
Mol. Mass.289.4158
SMILESCCCCCCOc1nccnc1C1CN2CCC1CC2