Reaction Details
TargetMuscarinic acetylcholine receptor M1
LigandBDBM50003359
Substrate/Competitorn/a
Meas. Tech.ChEMBL_138811 (CHEMBL747492)
IC50 2±n/a nM
Citation Ward, JSMerritt, LCalligaro, DOBymaster, FPShannon, HESawyer, BDMitch, CHDeeter, JBPeters, SCSheardown, MJ Functionally selective M1 muscarinic agonists. 3. Side chains and azacycles contributing to functional muscarinic selectivity among pyrazinylazacycles. J Med Chem38:3469-81 (1995) Muscarinic acetylcholine receptor M1
Name:Muscarinic acetylcholine receptor M1
Type:Enzyme Catalytic Domain
Mol. Mass.:51390.46
Organism:RAT
Description:P08482
Residue:460
BDBM50003359
NameBDBM50003359
Synonyms:5-(4-Hexyloxy-[1,2,5]thiadiazol-3-yl)-1-methyl-1,2,3,6-tetrahydro-pyridine; oxalic acid CHEMBL21536 LY 246708 | Xanomeline
TypeSmall organic molecule
Emp. Form.C14H23N3OS
Mol. Mass.281.417
SMILESCCCCCCOc1nsnc1C1=CCCN(C)C1