Reaction Details
TargetMuscarinic acetylcholine receptor M1
LigandBDBM50033147
Substrate/Competitorn/a
Meas. Tech.ChEMBL_138812 (CHEMBL747493)
IC50 10±n/a nM
Citation Ward, JSMerritt, LCalligaro, DOBymaster, FPShannon, HESawyer, BDMitch, CHDeeter, JBPeters, SCSheardown, MJ Functionally selective M1 muscarinic agonists. 3. Side chains and azacycles contributing to functional muscarinic selectivity among pyrazinylazacycles. J Med Chem38:3469-81 (1995) Muscarinic acetylcholine receptor M1
Name:Muscarinic acetylcholine receptor M1
Type:Enzyme Catalytic Domain
Mol. Mass.:51390.46
Organism:RAT
Description:P08482
Residue:460
BDBM50033147
NameBDBM50033147
Synonyms:3-(3-Butoxy-pyrazin-2-yl)-1-aza-bicyclo[2.2.2]octane | CHEMBL323719
TypeSmall organic molecule
Emp. Form.C15H23N3O
Mol. Mass.261.3626
SMILESCCCCOc1nccnc1C1CN2CCC1CC2