Reaction Details
TargetRibonucleoside-diphosphate reductase large subunit/subunit M2
LigandBDBM50033465
Substrate/Competitorn/a
Meas. Tech.ChEMBL_195386 (CHEMBL806875)
IC50 5±n/a nM
Citation Moss, NBeaulieu, PDuceppe, JSFerland, JMGauthier, JGhiro, EGoulet, SGrenier, LLlinas-Brunet, MPlante, R Peptidomimetic inhibitors of herpes simplex virus ribonucleotide reductase: a new class of antiviral agents. J Med Chem38:3617-23 (1995) Ribonucleoside-diphosphate reductase large subunit/subunit M2
Name:Ribonucleoside-diphosphate reductase large subunit/subunit M2
Type:Enzyme
Mol. Mass.:n/a
Description:n/a
Components:This complex has 2 components.
Component 1
Name:Ribonucleoside-diphosphate reductase large subunit
Synonyms:RIR1_HUMAN RRM1 Ribonucleoside-diphosphate reductase subunit M1 | Ribonucleotide reductase large subunit
Type:PROTEIN
Mol. Mass.:90074.67
Organism:Homo sapiens (Human)
Description:ChEMBL_90946
Residue:792
Component 2
Name:Ribonucleoside-diphosphate reductase subunit M2
Synonyms:RIR2_HUMAN RRM2 Ribonucleotide reductase small chain | Ribonucleotide reductase small subunit
Type:PROTEIN
Mol. Mass.:44868.59
Organism:Homo sapiens (Human)
Description:ChEMBL_195255
Residue:389
BDBM50033465
NameBDBM50033465
Synonyms:(S)-2-[(S)-3-Carboxy-2-((S)-2-{(S)-3-methyl-2-[(S)-3-methyl-2-(3-phenyl-propionylamino)-butyrylamino]-butyrylamino}-4-oxo-4-pyrrolidin-1-yl-butyrylamino)-propionylamino]-4,4-dimethyl-pentanoic acid | CHEMBL95766
TypeSmall organic molecule
Emp. Form.C38H58N6O10
Mol. Mass.758.9013
SMILESCC(C)[C@H](NC(=O)CCc1ccccc1)C(=O)N[C@@H](C(C)C)C(=O)N[C@@H](CC(=O)N1CCCC1)C(=O)N[C@@H](CC(O)=O)C(=O)N[C@@H](CC(C)(C)C)C(O)=O