Reaction Details
TargetRibonucleoside-diphosphate reductase large subunit/subunit M2
LigandBDBM50033468
Substrate/Competitorn/a
Meas. Tech.ChEMBL_38663 (CHEMBL652606)
EC50 150000±n/a nM
Citation Moss, NBeaulieu, PDuceppe, JSFerland, JMGauthier, JGhiro, EGoulet, SGrenier, LLlinas-Brunet, MPlante, R Peptidomimetic inhibitors of herpes simplex virus ribonucleotide reductase: a new class of antiviral agents. J Med Chem38:3617-23 (1995) Ribonucleoside-diphosphate reductase large subunit/subunit M2
Name:Ribonucleoside-diphosphate reductase large subunit/subunit M2
Type:Enzyme
Mol. Mass.:n/a
Description:n/a
Components:This complex has 2 components.
Component 1
Name:Ribonucleoside-diphosphate reductase large subunit
Synonyms:RIR1_HUMAN RRM1 Ribonucleoside-diphosphate reductase subunit M1 | Ribonucleotide reductase large subunit
Type:PROTEIN
Mol. Mass.:90074.67
Organism:Homo sapiens (Human)
Description:ChEMBL_90946
Residue:792
Component 2
Name:Ribonucleoside-diphosphate reductase subunit M2
Synonyms:RIR2_HUMAN RRM2 Ribonucleotide reductase small chain | Ribonucleotide reductase small subunit
Type:PROTEIN
Mol. Mass.:44868.59
Organism:Homo sapiens (Human)
Description:ChEMBL_195255
Residue:389
BDBM50033468
NameBDBM50033468
Synonyms:1-[(S)-[(S)-2-((S)-2-{(S)-2-[(2-Benzyl-3-phenyl-propionyl)-methyl-amino]-3-methyl-butyrylamino}-3,3-dimethyl-butyrylamino)-3-carbamoyl-propionylamino]-((S)-1-hydroxymethyl-3,3-dimethyl-butylcarbamoyl)-methyl]-cyclopentanecarboxylic acid | CHEMBL121447
TypeSmall organic molecule
Emp. Form.C47H70N6O9
Mol. Mass.863.0935
SMILESCC(C)[C@H](N(C)C(=O)C(Cc1ccccc1)Cc1ccccc1)C(=O)N[C@H](C(=O)N[C@@H](CC(N)=O)C(=O)N[C@H](C(=O)N[C@H](CO)CC(C)(C)C)C1(CCCC1)C(O)=O)C(C)(C)C