Reaction Details
TargetAlpha-2B adrenergic receptor
LigandBDBM50030617
Substrate/Competitorn/a
Meas. Tech.ChEMBL_33355 (CHEMBL644759)
Ki 275±n/a nM
Citation Ruffolo, RRBondinell, WHieble, JP Alpha- and beta-adrenoceptors: from the gene to the clinic. 2. Structure-activity relationships and therapeutic applications. J Med Chem38:3681-716 (1995) Alpha-2B adrenergic receptor
Name:Alpha-2B adrenergic receptor
Type:Enzyme
Mol. Mass.:49964.20
Organism:Homo sapiens (Human)
Description:P18089
Residue:450
BDBM50030617
NameBDBM50030617
Synonyms:2,6-Dimethyl-4-(4-nitro-phenyl)-pyridine-3,5-dicarboxylic acid 3-amide 5-{[3-(4,4-diphenyl-piperidin-1-yl)-propyl]-amide} | CHEMBL122671
TypeSmall organic molecule
Emp. Form.C35H37N5O4
Mol. Mass.591.6994
SMILESCc1nc(C)c(C(=O)NCCCN2CCC(CC2)(c2ccccc2)c2ccccc2)c(-c2ccc(cc2)[N+]([O-])=O)c1C(N)=O