Reaction Details
TargetAlpha-2B adrenergic receptor
LigandBDBM50030621
Substrate/Competitorn/a
Meas. Tech.ChEMBL_33355 (CHEMBL644759)
Ki 1230±n/a nM
Citation Ruffolo, RRBondinell, WHieble, JP Alpha- and beta-adrenoceptors: from the gene to the clinic. 2. Structure-activity relationships and therapeutic applications. J Med Chem38:3681-716 (1995) Alpha-2B adrenergic receptor
Name:Alpha-2B adrenergic receptor
Type:Enzyme
Mol. Mass.:49964.20
Organism:Homo sapiens (Human)
Description:P18089
Residue:450
BDBM50030621
NameBDBM50030621
Synonyms:5-[3-(4,4-Diphenyl-piperidin-1-yl)-propylcarbamoyl]-2,6-dimethyl-4-(3-nitro-phenyl)-nicotinic acid methyl ester | CHEMBL123102
TypeSmall organic molecule
Emp. Form.C36H38N4O5
Mol. Mass.606.7107
SMILESCOC(=O)c1c(C)nc(C)c(C(=O)NCCCN2CCC(CC2)(c2ccccc2)c2ccccc2)c1-c1cccc(c1)[N+]([O-])=O