Reaction Details
TargetAlpha-1B adrenergic receptor
LigandBDBM50366618
Substrate/Competitorn/a
Meas. Tech.ChEMBL_34343 (CHEMBL649156)
Ki 269±n/a nM
Citation Ruffolo, RRBondinell, WHieble, JP Alpha- and beta-adrenoceptors: from the gene to the clinic. 2. Structure-activity relationships and therapeutic applications. J Med Chem38:3681-716 (1995) Alpha-1B adrenergic receptor
Name:Alpha-1B adrenergic receptor
Type:Enzyme
Mol. Mass.:56862.13
Organism:Homo sapiens (Human)
Description:P35368
Residue:520
BDBM50366618
NameBDBM50366618
Synonyms:CHEMBL448620 | SNAP-5089
TypeSmall organic molecule
Emp. Form.C36H40N4O5
Mol. Mass.608.7266
SMILESCOC(=O)C1C(C(C(=O)NCCCN2CCC(CC2)(c2ccccc2)c2ccccc2)=C(C)N=C1C)c1ccc(cc1)[N+]([O-])=O