Reaction Details
TargetAlpha-1B adrenergic receptor
LigandBDBM50030623
Substrate/Competitorn/a
Meas. Tech.ChEMBL_34343 (CHEMBL649156)
Ki 87±n/a nM
Citation Ruffolo, RRBondinell, WHieble, JP Alpha- and beta-adrenoceptors: from the gene to the clinic. 2. Structure-activity relationships and therapeutic applications. J Med Chem38:3681-716 (1995) Alpha-1B adrenergic receptor
Name:Alpha-1B adrenergic receptor
Type:Enzyme
Mol. Mass.:56862.13
Organism:Homo sapiens (Human)
Description:P35368
Residue:520
BDBM50030623
NameBDBM50030623
Synonyms:6-Chloro-3-methyl-9-(3-methyl-but-2-enyloxy)-2,3,4,5-tetrahydro-1H-benzo[d]azepine SK&F-104078 SKF 104078
TypeSmall organic molecule
Emp. Form.C16H22ClNO
Mol. Mass.279.805
SMILES[#6]-[#7]-1-[#6]-[#6]-c2c(Cl)ccc(-[#8]-[#6]\[#6]=[#6](\[#6])-[#6])c2-[#6]-[#6]-1