Reaction Details
TargetAlpha-1A adrenergic receptor
LigandBDBM50026636
Substrate/Competitorn/a
Meas. Tech.ChEMBL_33729 (CHEMBL647045)
Ki 4400±n/a nM
Citation Ruffolo, RRBondinell, WHieble, JP Alpha- and beta-adrenoceptors: from the gene to the clinic. 2. Structure-activity relationships and therapeutic applications. J Med Chem38:3681-716 (1995) Alpha-1A adrenergic receptor
Name:Alpha-1A adrenergic receptor
Type:Cell-surface receptors
Mol. Mass.:51511.67
Organism:Homo sapiens (Human)
Description:P35348
Residue:466
BDBM50026636
NameBDBM50026636
Synonyms:17alpha-hydroxy-20alpha-yohimban-16beta-carboxylic acid methyl ester RAUWOLSCINE HYDROCHLORIDE corynanthidine mesoyohimbine methyl 17alpha-hydroxy-20alpha-yohimban-16beta-carboxylate | rauwolscine
TypeSmall organic molecule
Emp. Form.C21H26N2O3
Mol. Mass.354.4427
SMILESCOC(=O)[C@@H]1[C@@H](O)CC[C@@H]2CN3CCc4c([nH]c5ccccc45)[C@@H]3C[C@H]12