Reaction Details
TargetAlpha-1B adrenergic receptor
LigandBDBM50030624
Substrate/Competitorn/a
Meas. Tech.ChEMBL_34343 (CHEMBL649156)
Ki 85±n/a nM
Citation Ruffolo, RRBondinell, WHieble, JP Alpha- and beta-adrenoceptors: from the gene to the clinic. 2. Structure-activity relationships and therapeutic applications. J Med Chem38:3681-716 (1995) Alpha-1B adrenergic receptor
Name:Alpha-1B adrenergic receptor
Type:Enzyme
Mol. Mass.:56862.13
Organism:Homo sapiens (Human)
Description:P35368
Residue:520
BDBM50030624
NameBDBM50030624
Synonyms:2,6-Dimethyl-4-(4-nitro-phenyl)-pyridine-3,5-dicarboxylic acid 3-[3-(4,4-diphenyl-piperidin-1-yl)-propyl] ester 5-methyl ester | CHEMBL123769
TypeSmall organic molecule
Emp. Form.C36H37N3O6
Mol. Mass.607.6955
SMILESCOC(=O)c1c(C)nc(C)c(C(=O)OCCCN2CCC(CC2)(c2ccccc2)c2ccccc2)c1-c1ccc(cc1)[N+]([O-])=O