Reaction Details
TargetAlpha-1D adrenergic receptor
LigandBDBM50030624
Substrate/Competitorn/a
Meas. Tech.ChEMBL_32443 (CHEMBL646104)
Ki 302±n/a nM
Citation Ruffolo, RRBondinell, WHieble, JP Alpha- and beta-adrenoceptors: from the gene to the clinic. 2. Structure-activity relationships and therapeutic applications. J Med Chem38:3681-716 (1995) Alpha-1D adrenergic receptor
Name:Alpha-1D adrenergic receptor
Type:Enzyme Catalytic Domain
Mol. Mass.:60485.82
Organism:Homo sapiens (Human)
Description:adrenergic Alpha1D ADRA1D HUMAN::P25100
Residue:572
BDBM50030624
NameBDBM50030624
Synonyms:2,6-Dimethyl-4-(4-nitro-phenyl)-pyridine-3,5-dicarboxylic acid 3-[3-(4,4-diphenyl-piperidin-1-yl)-propyl] ester 5-methyl ester | CHEMBL123769
TypeSmall organic molecule
Emp. Form.C36H37N3O6
Mol. Mass.607.6955
SMILESCOC(=O)c1c(C)nc(C)c(C(=O)OCCCN2CCC(CC2)(c2ccccc2)c2ccccc2)c1-c1ccc(cc1)[N+]([O-])=O