Reaction Details
TargetAlpha-1D adrenergic receptor
LigandBDBM50030621
Substrate/Competitorn/a
Meas. Tech.ChEMBL_32443 (CHEMBL646104)
Ki 426±n/a nM
Citation Ruffolo, RRBondinell, WHieble, JP Alpha- and beta-adrenoceptors: from the gene to the clinic. 2. Structure-activity relationships and therapeutic applications. J Med Chem38:3681-716 (1995) Alpha-1D adrenergic receptor
Name:Alpha-1D adrenergic receptor
Type:Enzyme Catalytic Domain
Mol. Mass.:60485.82
Organism:Homo sapiens (Human)
Description:adrenergic Alpha1D ADRA1D HUMAN::P25100
Residue:572
BDBM50030621
NameBDBM50030621
Synonyms:5-[3-(4,4-Diphenyl-piperidin-1-yl)-propylcarbamoyl]-2,6-dimethyl-4-(3-nitro-phenyl)-nicotinic acid methyl ester | CHEMBL123102
TypeSmall organic molecule
Emp. Form.C36H38N4O5
Mol. Mass.606.7107
SMILESCOC(=O)c1c(C)nc(C)c(C(=O)NCCCN2CCC(CC2)(c2ccccc2)c2ccccc2)c1-c1cccc(c1)[N+]([O-])=O