Reaction Details
TargetAlpha-1A adrenergic receptor
LigandBDBM50030621
Substrate/Competitorn/a
Meas. Tech.ChEMBL_33729 (CHEMBL647045)
Ki 0.40±n/a nM
Citation Ruffolo, RRBondinell, WHieble, JP Alpha- and beta-adrenoceptors: from the gene to the clinic. 2. Structure-activity relationships and therapeutic applications. J Med Chem38:3681-716 (1995) Alpha-1A adrenergic receptor
Name:Alpha-1A adrenergic receptor
Type:Cell-surface receptors
Mol. Mass.:51511.67
Organism:Homo sapiens (Human)
Description:P35348
Residue:466
BDBM50030621
NameBDBM50030621
Synonyms:5-[3-(4,4-Diphenyl-piperidin-1-yl)-propylcarbamoyl]-2,6-dimethyl-4-(3-nitro-phenyl)-nicotinic acid methyl ester | CHEMBL123102
TypeSmall organic molecule
Emp. Form.C36H38N4O5
Mol. Mass.606.7107
SMILESCOC(=O)c1c(C)nc(C)c(C(=O)NCCCN2CCC(CC2)(c2ccccc2)c2ccccc2)c1-c1cccc(c1)[N+]([O-])=O