Reaction Details
TargetAdenosine deaminase
LigandBDBM50031266
Substrate/Competitorn/a
Meas. Tech.ChEMBL_30794 (CHEMBL645070)
Ki>100000±n/a nM
Citation Cristalli, GVittori, SEleuteri, AVolpini, RCamaioni, ELupidi, GMahmood, NBevilacqua, FPalù, G Synthesis and biological evaluation of N6-cycloalkyl derivatives of 1-deazaadenine nucleosides: a new class of anti-human immunodeficiency virus agents. J Med Chem38:4019-25 (1995) Adenosine deaminase
Name:Adenosine deaminase
Type:Enzyme
Mol. Mass.:40910.44
Organism:Bos taurus (bovine)
Description:n/a
Residue:363
BDBM50031266
NameBDBM50031266
Synonyms:CHEMBL131998 | [5-(7-Cyclooctylamino-imidazo[4,5-b]pyridin-3-yl)-tetrahydro-furan-2-yl]-methanol
TypeSmall organic molecule
Emp. Form.C19H28N4O2
Mol. Mass.344.4512
SMILESOCC1CCC(O1)n1cnc2c(NC3CCCCCCC3)ccnc12