Reaction Details
TargetAdenosine deaminase
LigandBDBM50023668
Substrate/Competitorn/a
Meas. Tech.ChEMBL_30794 (CHEMBL645070)
Ki 380±n/a nM
Citation Cristalli, GVittori, SEleuteri, AVolpini, RCamaioni, ELupidi, GMahmood, NBevilacqua, FPalù, G Synthesis and biological evaluation of N6-cycloalkyl derivatives of 1-deazaadenine nucleosides: a new class of anti-human immunodeficiency virus agents. J Med Chem38:4019-25 (1995) Adenosine deaminase
Name:Adenosine deaminase
Type:Enzyme
Mol. Mass.:40910.44
Organism:Bos taurus (bovine)
Description:n/a
Residue:363
BDBM50023668
NameBDBM50023668
Synonyms:2-(7-Amino-imidazo[4,5-b]pyridin-3-yl)-5-hydroxymethyl-tetrahydro-furan-3,4-diol | CHEMBL17351
TypeSmall organic molecule
Emp. Form.C11H14N4O4
Mol. Mass.266.2533
SMILESNc1ccnc2n(cnc12)C1O[C@H](CO)[C@@H](O)[C@H]1O