Reaction Details
TargetAdenosine deaminase
LigandBDBM50031292
Substrate/Competitorn/a
Meas. Tech.ChEMBL_30794 (CHEMBL645070)
Ki 4200±n/a nM
Citation Cristalli, GVittori, SEleuteri, AVolpini, RCamaioni, ELupidi, GMahmood, NBevilacqua, FPalù, G Synthesis and biological evaluation of N6-cycloalkyl derivatives of 1-deazaadenine nucleosides: a new class of anti-human immunodeficiency virus agents. J Med Chem38:4019-25 (1995) Adenosine deaminase
Name:Adenosine deaminase
Type:Enzyme
Mol. Mass.:40910.44
Organism:Bos taurus (bovine)
Description:n/a
Residue:363
BDBM50031292
NameBDBM50031292
Synonyms:5-(5-Chloro-7-methylamino-imidazo[4,5-b]pyridin-3-yl)-2-hydroxymethyl-tetrahydro-furan-3-ol | CHEMBL128273
TypeSmall organic molecule
Emp. Form.C12H15ClN4O3
Mol. Mass.298.726
SMILESCNc1cc(Cl)nc2n(cnc12)C1CC(O)C(CO)O1