Reaction Details
Target5-hydroxytryptamine receptor 1A
LigandBDBM50029326
Substrate/Competitorn/a
Meas. Tech.ChEMBL_1435 (CHEMBL616308)
Ki 0.13±n/a nM
Citation Reitz, ABBaxter, EWBennett, DJCodd, EEJordan, ADMalloy, EAMaryanoff, BEMcDonnell, MEOrtegon, MERenzi, MJ N-aryl-N'-benzylpiperazines as potential antipsychotic agents. J Med Chem38:4211-22 (1995) 5-hydroxytryptamine receptor 1A
Name:5-hydroxytryptamine receptor 1A
Type:G Protein-Coupled Receptor (GPCR)
Mol. Mass.:46445.29
Organism:Rattus norvegicus (rat)
Description:Binding assays were performed using rat hippocampal membranes.
Residue:422
BDBM50029326
NameBDBM50029326
Synonyms:8-{3-[4-(2-Isopropoxy-phenyl)-piperazin-1-ylmethyl]-benzyl}-8-aza-spiro[4.5]decane-7,9-dione | CHEMBL423712
TypeSmall organic molecule
Emp. Form.C30H39N3O3
Mol. Mass.489.649
SMILESCC(C)Oc1ccccc1N1CCN(Cc2cccc(CN3C(=O)CC4(CCCC4)CC3=O)c2)CC1