Reaction Details
Target5-hydroxytryptamine receptor 1A
LigandBDBM50029257
Substrate/Competitorn/a
Meas. Tech.ChEMBL_1435 (CHEMBL616308)
Ki 1.7±n/a nM
Citation Reitz, ABBaxter, EWBennett, DJCodd, EEJordan, ADMalloy, EAMaryanoff, BEMcDonnell, MEOrtegon, MERenzi, MJ N-aryl-N'-benzylpiperazines as potential antipsychotic agents. J Med Chem38:4211-22 (1995) 5-hydroxytryptamine receptor 1A
Name:5-hydroxytryptamine receptor 1A
Type:G Protein-Coupled Receptor (GPCR)
Mol. Mass.:46445.29
Organism:Rattus norvegicus (rat)
Description:Binding assays were performed using rat hippocampal membranes.
Residue:422
BDBM50029257
NameBDBM50029257
Synonyms:(3-((4-(2-isopropoxyphenyl)piperazin-1-yl)methyl)phenyl)(piperidin-1-yl)methanone RWJ-377796 {3-[4-(2-Isopropoxy-phenyl)-piperazin-1-ylmethyl]-phenyl}-piperidin-1-yl-methanone
TypeSmall organic molecule
Emp. Form.C26H35N3O2
Mol. Mass.421.575
SMILESCC(C)Oc1ccccc1N1CCN(Cc2cccc(c2)C(=O)N2CCCCC2)CC1