Reaction Details
TargetTranslocator protein
LigandBDBM50000766
Substrate/Competitorn/a
Meas. Tech.ChEMBL_37050 (CHEMBL652439)
Kd 213±n/a nM
Citation Dalpiaz, ABertolasi, VBorea, PANacci, VFiorini, ICampiani, GMennini, TManzoni, CNovellino, EGreco, G A concerted study using binding measurements, X-ray structural data, and molecular modeling on the stereochemical features responsible for the affinity of 6-arylpyrrolo[2,1-d][1,5]benzothiazepines toward mitochondrial benzodiazepine receptors. J Med Chem38:4730-8 (1995) Translocator protein
Name:Translocator protein
Type:Mitochondrion membrane protein
Mol. Mass.:18945.84
Organism:Rattus norvegicus (rat)
Description:Competitive binding experiments were performed on rat kidney mitochondrial membranes.
Residue:169
BDBM50000766
NameBDBM50000766
Synonyms:CHEMBL12 US9271961, Diazepam
TypeSmall organic molecule
Emp. Form.C16H13ClN2O
Mol. Mass.284.74
SMILESCN1c2ccc(Cl)cc2C(=NCC1=O)c1ccccc1