Reaction Details
TargetAcetylcholinesterase
LigandBDBM9405
Substrate/Competitorn/a
Meas. Tech.ChEMBL_28910 (CHEMBL638608)
IC50 170±n/a nM
Citation Sugimoto, HIimura, YYamanishi, YYamatsu, K Synthesis and structure-activity relationships of acetylcholinesterase inhibitors: 1-benzyl-4-[(5,6-dimethoxy-1-oxoindan-2-yl)methyl]piperidine hydrochloride and related compounds. J Med Chem38:4821-9 (1996) Acetylcholinesterase
Name:Acetylcholinesterase
Type:Enzyme
Mol. Mass.:68165.65
Organism:Mus musculus (mouse)
Description:n/a
Residue:614
BDBM9405
NameBDBM9405
Synonyms:CHEMBL56470 N-[2-(1-benzylpiperidin-4-yl)ethyl]-N-methylbenzamide hydrochloride | Piperidine Derivative 13
TypeSmall organic molecule
Emp. Form.C22H28N2O
Mol. Mass.336.4705
SMILESCN(CCC1CCN(Cc2ccccc2)CC1)C(=O)c1ccccc1