Reaction Details
TargetAcetylcholinesterase
LigandBDBM8960
Substrate/Competitorn/a
Meas. Tech.ChEMBL_28910 (CHEMBL638608)
IC50 5.7±n/a nM
Citation Sugimoto, HIimura, YYamanishi, YYamatsu, K Synthesis and structure-activity relationships of acetylcholinesterase inhibitors: 1-benzyl-4-[(5,6-dimethoxy-1-oxoindan-2-yl)methyl]piperidine hydrochloride and related compounds. J Med Chem38:4821-9 (1996) Acetylcholinesterase
Name:Acetylcholinesterase
Type:Enzyme
Mol. Mass.:68165.65
Organism:Mus musculus (mouse)
Description:n/a
Residue:614
BDBM8960
NameBDBM8960
Synonyms:(+/-)-2-[(1-benzylpiperidin-4-yl)methyl]-5,6-dimethoxy-indan-1-one Aricept CHEMBL1678 CHEMBL502 Donepezil E2020 US9346818, DPH US9663465, Donepezil
TypeSmall organic molecule
Emp. Form.C24H29NO3
Mol. Mass.379.492
SMILESCOc1cc2CC(CC3CCN(Cc4ccccc4)CC3)C(=O)c2cc1OC