Reaction Details
TargetAcetylcholinesterase
LigandBDBM50029933
Substrate/Competitorn/a
Meas. Tech.ChEMBL_28910 (CHEMBL638608)
IC50 1.5±n/a nM
Citation Sugimoto, HIimura, YYamanishi, YYamatsu, K Synthesis and structure-activity relationships of acetylcholinesterase inhibitors: 1-benzyl-4-[(5,6-dimethoxy-1-oxoindan-2-yl)methyl]piperidine hydrochloride and related compounds. J Med Chem38:4821-9 (1996) Acetylcholinesterase
Name:Acetylcholinesterase
Type:Enzyme
Mol. Mass.:68165.65
Organism:Mus musculus (mouse)
Description:n/a
Residue:614
BDBM50029933
NameBDBM50029933
Synonyms:2-[3-(1-Benzyl-piperidin-4-yl)-propyl]-5,6-dimethoxy-indan-1-one | CHEMBL145446
TypeSmall organic molecule
Emp. Form.C26H33NO3
Mol. Mass.407.5451
SMILESCOc1cc2CC(CCCC3CCN(Cc4ccccc4)CC3)C(=O)c2cc1OC