Reaction Details
TargetL-selectin
LigandBDBM50422122
Substrate/Competitorn/a
Meas. Tech.ChEMBL_200001 (CHEMBL810690)
IC50 5000000±n/a nM
Citation Kogan, TPDupré, BKeller, KMScott, ILBui, HMarket, RVBeck, PJVoytus, JARevelle, BMScott, D Rational design and synthesis of small molecule, non-oligosaccharide selectin inhibitors: (alpha-D-mannopyranosyloxy)biphenyl-substituted carboxylic acids. J Med Chem38:4976-84 (1996) L-selectin
Name:L-selectin
Type:PROTEIN
Mol. Mass.:42288.63
Organism:Mus musculus
Description:ChEMBL_199996
Residue:372
BDBM50422122
NameBDBM50422122
Synonyms:CHEMBL2303951
TypeSmall organic molecule
Emp. Form.C23H25NO11
Mol. Mass.491.4447
SMILESOC[C@H]1O[C@H](Oc2ccccc2-c2ccc(cc2)C(=O)NC(CC(O)=O)C(O)=O)[C@@H](O)[C@H](O)[C@@H]1O