Reaction Details
TargetNeprilysin
LigandBDBM50048309
Substrate/Competitorn/a
Meas. Tech.ChEMBL_144596 (CHEMBL747371)
IC50 15±n/a nM
Citation Fink, CAQiao, YBerry, CJSakane, YGhai, RDTrapani, AJ New alpha-thiol dipeptide dual inhibitors of angiotensin-I converting enzyme and neutral endopeptidase EC 3.4.24.11. J Med Chem38:5023-30 (1996) Neprilysin
Name:Neprilysin
Type:Protein
Mol. Mass.:85789.59
Organism:Rattus norvegicus (Rat)
Description:P07861
Residue:750
BDBM50048309
NameBDBM50048309
Synonyms:(S)-3-(4-Hydroxy-phenyl)-2-{[1-(2-mercapto-acetylamino)-cyclopentanecarbonyl]-amino}-propionic acid | CHEMBL342993
TypeSmall organic molecule
Emp. Form.C17H22N2O5S
Mol. Mass.366.432
SMILESOC(=O)[C@H](Cc1ccc(O)cc1)NC(=O)C1(CCCC1)NC(=O)CS