Reaction Details
TargetAngiotensin-converting enzyme
LigandBDBM50048316
Substrate/Competitorn/a
Meas. Tech.ChEMBL_34786 (CHEMBL643763)
IC50 37±n/a nM
Citation Fink, CAQiao, YBerry, CJSakane, YGhai, RDTrapani, AJ New alpha-thiol dipeptide dual inhibitors of angiotensin-I converting enzyme and neutral endopeptidase EC 3.4.24.11. J Med Chem38:5023-30 (1996) Angiotensin-converting enzyme
Name:Angiotensin-converting enzyme
Type:n/a
Mol. Mass.:150405.15
Organism:Oryctolagus cuniculus
Description:n/a
Residue:1310
BDBM50048316
NameBDBM50048316
Synonyms:(S)-2-{[1-((S)-2-Mercapto-3-methyl-butyrylamino)-cyclopentanecarbonyl]-amino}-3-pyridin-3-yl-propionic acid | CHEMBL356084
TypeSmall organic molecule
Emp. Form.C19H27N3O4S
Mol. Mass.393.5
SMILESCC(C)[C@H](S)C(=O)NC1(CCCC1)C(=O)N[C@@H](Cc1cccnc1)C(O)=O