Reaction Details
TargetNeprilysin
LigandBDBM50048318
Substrate/Competitorn/a
Meas. Tech.ChEMBL_144596 (CHEMBL747371)
IC50 1.2±n/a nM
Citation Fink, CAQiao, YBerry, CJSakane, YGhai, RDTrapani, AJ New alpha-thiol dipeptide dual inhibitors of angiotensin-I converting enzyme and neutral endopeptidase EC 3.4.24.11. J Med Chem38:5023-30 (1996) Neprilysin
Name:Neprilysin
Type:Protein
Mol. Mass.:85789.59
Organism:Rattus norvegicus (Rat)
Description:P07861
Residue:750
BDBM50048318
NameBDBM50048318
Synonyms:(S)-2-{[1-((S)-2-Mercapto-3-methyl-butyrylamino)-cyclopentanecarbonyl]-amino}-4-phenyl-butyric acid | CHEMBL358592
TypeSmall organic molecule
Emp. Form.C21H30N2O4S
Mol. Mass.406.539
SMILESCC(C)[C@H](S)C(=O)NC1(CCCC1)C(=O)N[C@@H](CCc1ccccc1)C(O)=O