Reaction Details
TargetAngiotensin-converting enzyme
LigandBDBM50048320
Substrate/Competitorn/a
Meas. Tech.ChEMBL_34786 (CHEMBL643763)
IC50 18±n/a nM
Citation Fink, CAQiao, YBerry, CJSakane, YGhai, RDTrapani, AJ New alpha-thiol dipeptide dual inhibitors of angiotensin-I converting enzyme and neutral endopeptidase EC 3.4.24.11. J Med Chem38:5023-30 (1996) Angiotensin-converting enzyme
Name:Angiotensin-converting enzyme
Type:n/a
Mol. Mass.:150405.15
Organism:Oryctolagus cuniculus
Description:n/a
Residue:1310
BDBM50048320
NameBDBM50048320
Synonyms:(S)-2-{[1-((S)-2-Mercapto-3-methyl-butyrylamino)-cyclopentanecarbonyl]-amino}-3-thiophen-2-yl-propionic acid | CHEMBL356123
TypeSmall organic molecule
Emp. Form.C18H26N2O4S2
Mol. Mass.398.54
SMILESCC(C)[C@H](S)C(=O)NC1(CCCC1)C(=O)N[C@@H](Cc1cccs1)C(O)=O