Reaction Details
TargetNeprilysin
LigandBDBM50048307
Substrate/Competitorn/a
Meas. Tech.ChEMBL_144596 (CHEMBL747371)
IC50 25±n/a nM
Citation Fink, CAQiao, YBerry, CJSakane, YGhai, RDTrapani, AJ New alpha-thiol dipeptide dual inhibitors of angiotensin-I converting enzyme and neutral endopeptidase EC 3.4.24.11. J Med Chem38:5023-30 (1996) Neprilysin
Name:Neprilysin
Type:Protein
Mol. Mass.:85789.59
Organism:Rattus norvegicus (Rat)
Description:P07861
Residue:750
BDBM50048307
NameBDBM50048307
Synonyms:(S)-3-(4-Hydroxy-phenyl)-2-{[2-((S)-2-mercapto-3-methyl-butyrylamino)-indane-2-carbonyl]-amino}-propionic acid | CHEMBL147595
TypeSmall organic molecule
Emp. Form.C24H28N2O5S
Mol. Mass.456.555
SMILESCC(C)[C@H](S)C(=O)NC1(Cc2ccccc2C1)C(=O)N[C@@H](Cc1ccc(O)cc1)C(O)=O